Target
Vasopressin V1a receptor
Ligand
BDBM35667
Substrate
Meas. Tech.
ChEMBL_211095 (CHEMBL815438)
Kd
0.640000±n/a nM
Citation
 Barbeau, DGuay, SNeugebauer, WEscher, E Preparation and biological activities of potential vasopressin photoaffinity labels. J Med Chem 35:151-7 (1992)  
Target
Name:
Vasopressin V1a receptor
Synonyms:
Avpr1a VASOPRESSIN V1A Vasopressin V1a receptor | Vasopressin receptor
Type:
Enzyme Catalytic Domain
Mol. Mass.:
47674.81
Organism:
RAT
Description:
VASOPRESSIN V1A AVPR1A RAT::P30560
Residue:
424
  
Inhibitor
Name:
BDBM35667
Synonyms:
AVP US10131692, 44 (AVP) [3H]Argipressin tannate | [3H]vasopressin
Type:
radiolabeled ligand
Emp. Form.:
C46H65N15O12S2
Mol. Mass.:
1084.232
SMILES:
[#7]-[#6@H]-1-[#6]-[#16]-[#16]-[#6]-[#6@H](-[#7]-[#6](=O)-[#6@H](-[#6]-[#6](-[#7])=O)-[#7]-[#6](=O)-[#6@H](-[#6]-[#6]-[#6](-[#7])=O)-[#7]-[#6](=O)-[#6@H](-[#6]-c2ccccc2)-[#7]-[#6](=O)-[#6@H](-[#6]-c2ccc(-[#8])cc2)-[#7]-[#6]-1=O)-[#6](=O)-[#7]-1-[#6]-[#6]-[#6]-[#6@H]-1-[#6](=O)-[#7]-[#6@@H](-[#6]-[#6]-[#6]\[#7]=[#6](\[#7])-[#7])-[#6](=O)-[#7]-[#6]-[#6](-[#7])=O
: