Target
Vasopressin V1a receptor
Ligand
BDBM50008096
Substrate
Meas. Tech.
ChEMBL_214391 (CHEMBL819412)
Kd
35±n/a nM
Citation
 Barbeau, DGuay, SNeugebauer, WEscher, E Preparation and biological activities of potential vasopressin photoaffinity labels. J Med Chem 35:151-7 (1992)  
Target
Name:
Vasopressin V1a receptor
Synonyms:
Avpr1a VASOPRESSIN V1A Vasopressin V1a receptor | Vasopressin receptor
Type:
Enzyme Catalytic Domain
Mol. Mass.:
47674.81
Organism:
RAT
Description:
VASOPRESSIN V1A AVPR1A RAT::P30560
Residue:
424
  
Inhibitor
Name:
BDBM50008096
Synonyms:
CHEMBL2372414 | cyclo(Ppa-Phe(N3)-Phe-Val-Asn-Cys)-Pro-Lys-D-Tyr-NH2
Type:
Small organic molecule
Emp. Form.:
C57H76N14O11S2
Mol. Mass.:
1197.431
SMILES:
CC(C)[C@@H]1NC(=O)[C@H](Cc2ccccc2)NC(=O)[C@H](Cc2ccc(cc2)N=[N+]=[N-])NC(=O)C2(CCCC2)CSSC[C@H](NC(=O)[C@H](CC(N)=O)NC1=O)C(=O)N1CCC[C@H]1C(=O)N[C@@H](CCCCN)C(=O)N[C@H](Cc1ccc(O)cc1)C(N)=O
: