Target
Vasopressin V1a receptor
Ligand
BDBM50008084
Substrate
Meas. Tech.
ChEMBL_214391 (CHEMBL819412)
Kd
41±n/a nM
Citation
 Barbeau, DGuay, SNeugebauer, WEscher, E Preparation and biological activities of potential vasopressin photoaffinity labels. J Med Chem 35:151-7 (1992)  
Target
Name:
Vasopressin V1a receptor
Synonyms:
Avpr1a VASOPRESSIN V1A Vasopressin V1a receptor | Vasopressin receptor
Type:
Enzyme Catalytic Domain
Mol. Mass.:
47674.81
Organism:
RAT
Description:
VASOPRESSIN V1A AVPR1A RAT::P30560
Residue:
424
  
Inhibitor
Name:
BDBM50008084
Synonyms:
1-[13-Benzyl-7-carbamoylmethyl-10-isopropyl-16-(4-nitro-benzyl)-6,9,12,15,18-pentaoxo-1,2-dithia-5,8,11,14,17-pentaaza-cycloicosane-4-carbonyl]-pyrrolidine-2-carboxylic acid {5-amino-1-[1-carbamoyl-2-(4-hydroxy-phenyl)-ethylcarbamoyl]-pentyl}-amide | CHEMBL2372417
Type:
Small organic molecule
Emp. Form.:
C46H64N16O14S2
Mol. Mass.:
1129.229
SMILES:
[#7]-[#6@H]-1-[#6]-[#16]-[#16]-[#6]-[#6@H](-[#7]-[#6](=O)-[#6@H](-[#6]-[#6](-[#7])=O)-[#7]-[#6](=O)-[#6@H](-[#6]-[#6]-[#6](-[#7])=O)-[#7]-[#6](=O)-[#6@H](-[#6]-c2ccc(cc2)-[#7+](-[#8-])=O)-[#7]-[#6](=O)-[#6@H](-[#6]-c2ccc(-[#8])cc2)-[#7]-[#6]-1=O)-[#6](=O)-[#7]-1-[#6]-[#6]-[#6]-[#6@H]-1-[#6](=O)-[#7]-[#6@@H](-[#6]-[#6]-[#6]\[#7]=[#6](/[#7])-[#7])-[#6](=O)-[#7]-[#6]-[#6](-[#7])=O
: