Target
Vasopressin V1a receptor
Ligand
BDBM50008088
Substrate
Meas. Tech.
ChEMBL_214388 (CHEMBL821119)
Kd
2.6±n/a nM
Citation
 Barbeau, DGuay, SNeugebauer, WEscher, E Preparation and biological activities of potential vasopressin photoaffinity labels. J Med Chem 35:151-7 (1992)  
Target
Name:
Vasopressin V1a receptor
Synonyms:
Avpr1a VASOPRESSIN V1A Vasopressin V1a receptor | Vasopressin receptor
Type:
Enzyme Catalytic Domain
Mol. Mass.:
47674.81
Organism:
RAT
Description:
VASOPRESSIN V1A AVPR1A RAT::P30560
Residue:
424
  
Inhibitor
Name:
BDBM50008088
Synonyms:
CHEMBL2372416 | cyclo(Depa-Phe(N3)-Phe-Val-Asn-Cys)-Pro-Lys-D-Tyr-NH2
Type:
Small organic molecule
Emp. Form.:
C57H78N14O11S2
Mol. Mass.:
1199.446
SMILES:
CCC1(CC)CSSC[C@H](NC(=O)[C@H](CC(N)=O)NC(=O)[C@@H](NC(=O)[C@H](Cc2ccccc2)NC(=O)[C@H](Cc2ccc(cc2)N=[N+]=[N-])NC1=O)C(C)C)C(=O)N1CCC[C@H]1C(=O)N[C@@H](CCCCN)C(=O)N[C@H](Cc1ccc(O)cc1)C(N)=O
: