Target
Cathepsin D
Ligand
BDBM50008127
Substrate
Meas. Tech.
ChEBML_44987
IC50
47±n/a nM
Citation
 Doherty, AMSircar, IKornberg, BEQuin, JWinters, RTKaltenbronn, JSTaylor, MDBatley, BLRapundalo, SRRyan, MJ Design and synthesis of potent, selective, and orally active fluorine-containing renin inhibitors. J Med Chem 35:2-14 (1992)  
Target
Name:
Cathepsin D
Synonyms:
CATD_BOVIN | CTSD
Type:
PROTEIN
Mol. Mass.:
42158.92
Organism:
Bos taurus
Description:
ChEMBL_1458606
Residue:
387
  
Inhibitor
Name:
BDBM50008127
Synonyms:
2-[3-Phenyl-2-(piperazine-1-sulfonylamino)-propionylamino]-pent-4-enoic acid [1-cyclohexylmethyl-3,3-difluoro-3-(2-methyl-butylcarbamoyl)-2-oxo-propyl]-amide; Hydrate | CHEMBL285095
Type:
Small organic molecule
Emp. Form.:
C34H52F2N6O6S
Mol. Mass.:
710.875
SMILES:
CC[C@H](C)CNC(=O)C(F)(F)C(=O)[C@H](CC1CCCCC1)NC(=O)[C@H](CC=C)NC(=O)[C@H](Cc1ccccc1)NS(=O)(=O)N1CCNCC1
: