Target
Renin
Ligand
BDBM50008124
Substrate
Meas. Tech.
ChEBML_192731
IC50
0.870000±n/a nM
Citation
 Doherty, AMSircar, IKornberg, BEQuin, JWinters, RTKaltenbronn, JSTaylor, MDBatley, BLRapundalo, SRRyan, MJ Design and synthesis of potent, selective, and orally active fluorine-containing renin inhibitors. J Med Chem 35:2-14 (1992)  
Target
Name:
Renin
Synonyms:
Angiotensinogenase RENI_HUMAN
Type:
Enzyme
Mol. Mass.:
45058.99
Organism:
Homo sapiens (Human)
Description:
Residue:
406
  
Inhibitor
Name:
BDBM50008124
Synonyms:
2-[2-(Morpholine-4-sulfonylamino)-3-phenyl-propionylamino]-pent-4-enoic acid [1-cyclohexyl-3,3-difluoro-2-hydroxy-3-(2-morpholin-4-yl-ethylcarbamoyl)-propyl]-amide; Hydrate | CHEMBL265316
Type:
Small organic molecule
Emp. Form.:
C34H52F2N6O8S
Mol. Mass.:
742.874
SMILES:
OC([C@@H](NC(=O)[C@H](CC=C)NC(=O)[C@H](Cc1ccccc1)NS(=O)(=O)N1CCOCC1)C1CCCCC1)C(F)(F)C(=O)NCCN1CCOCC1
: