Target
Renin
Ligand
BDBM50008143
Substrate
Meas. Tech.
ChEBML_192731
IC50
10±n/a nM
Citation
 Doherty, AMSircar, IKornberg, BEQuin, JWinters, RTKaltenbronn, JSTaylor, MDBatley, BLRapundalo, SRRyan, MJ Design and synthesis of potent, selective, and orally active fluorine-containing renin inhibitors. J Med Chem 35:2-14 (1992)  
Target
Name:
Renin
Synonyms:
Angiotensinogenase RENI_HUMAN
Type:
Enzyme
Mol. Mass.:
45058.99
Organism:
Homo sapiens (Human)
Description:
Residue:
406
  
Inhibitor
Name:
BDBM50008143
Synonyms:
2-[2-(Morpholine-4-sulfonylamino)-3-oxo-3-phenyl-propionylamino]-pent-4-enoic acid [1-cyclohexylmethyl-3,3-difluoro-3-(2-morpholin-4-yl-ethylcarbamoyl)-2-oxo-propyl]-amide; Hydrate | CHEMBL31438
Type:
Small organic molecule
Emp. Form.:
C35H50F2N6O9S
Mol. Mass.:
768.868
SMILES:
FC(F)(C(=O)NCCN1CCOCC1)C(=O)[C@H](CC1CCCCC1)NC(=O)[C@H](CC=C)NC(=O)[C@@H](NS(=O)(=O)N1CCOCC1)C(=O)c1ccccc1
: