Target
Renin
Ligand
BDBM50008150
Substrate
Meas. Tech.
ChEBML_192731
IC50
12±n/a nM
Citation
 Doherty, AMSircar, IKornberg, BEQuin, JWinters, RTKaltenbronn, JSTaylor, MDBatley, BLRapundalo, SRRyan, MJ Design and synthesis of potent, selective, and orally active fluorine-containing renin inhibitors. J Med Chem 35:2-14 (1992)  
Target
Name:
Renin
Synonyms:
Angiotensinogenase RENI_HUMAN
Type:
Enzyme
Mol. Mass.:
45058.99
Organism:
Homo sapiens (Human)
Description:
Residue:
406
  
Inhibitor
Name:
BDBM50008150
Synonyms:
5-Cyclohexyl-2,2-difluoro-3-hydroxy-4-{2-[2-(morpholine-4-sulfonylamino)-3-phenyl-propionylamino]-acetylamino}-pentanoic acid (2-morpholin-4-yl-ethyl)-amide; CH2Cl2 | CHEMBL31201
Type:
Small organic molecule
Emp. Form.:
C32H50F2N6O8S
Mol. Mass.:
716.837
SMILES:
OC([C@H](CC1CCCCC1)NC(=O)CNC(=O)[C@H](Cc1ccccc1)NS(=O)(=O)N1CCOCC1)C(F)(F)C(=O)NCCN1CCOCC1
: