Target
Renin
Ligand
BDBM50008158
Substrate
Meas. Tech.
ChEBML_192731
IC50
0.320000±n/a nM
Citation
 Doherty, AMSircar, IKornberg, BEQuin, JWinters, RTKaltenbronn, JSTaylor, MDBatley, BLRapundalo, SRRyan, MJ Design and synthesis of potent, selective, and orally active fluorine-containing renin inhibitors. J Med Chem 35:2-14 (1992)  
Target
Name:
Renin
Synonyms:
Angiotensinogenase RENI_HUMAN
Type:
Enzyme
Mol. Mass.:
45058.99
Organism:
Homo sapiens (Human)
Description:
Residue:
406
  
Inhibitor
Name:
BDBM50008158
Synonyms:
2-[2-(Morpholine-4-sulfonylamino)-3-phenyl-propionylamino]-pent-4-enoic acid [1-cyclohexylmethyl-3-(2-ethylsulfanyl-propylcarbamoyl)-3,3-difluoro-2-hydroxy-propyl]-amide | CHEMBL282756
Type:
Small organic molecule
Emp. Form.:
C34H53F2N5O7S2
Mol. Mass.:
745.941
SMILES:
CCS[C@H](C)CNC(=O)C(F)(F)C(O)[C@H](CC1CCCCC1)NC(=O)[C@H](CC=C)NC(=O)[C@H](Cc1ccccc1)NS(=O)(=O)N1CCOCC1
: