Target
Gastrin/cholecystokinin type B receptor
Ligand
BDBM50008183
Substrate
Meas. Tech.
ChEBML_216728
IC50
16500±n/a nM
Citation
 Makovec, FPeris, WRevel, LGiovanetti, RMennuni, LRovati, LC Structure-antigastrin activity relationships of new (R)-4-benzamido-5-oxopentanoic acid derivatives. J Med Chem 35:28-38 (1992)  
Target
Name:
Gastrin/cholecystokinin type B receptor
Synonyms:
Cckbr Cholecystokinin B receptor GASR_RAT | Gastrin/cholecystokinin type B receptor
Type:
Enzyme Catalytic Domain
Mol. Mass.:
48980.43
Organism:
RAT
Description:
Cholecystokinin A CCKBR RAT::P30553
Residue:
452
  
Inhibitor
Name:
BDBM50008183
Synonyms:
4-(8-Aza-spiro[4.5]dec-8-ylcarbamoyl)-4-(3-methoxy-benzoylamino)-butyric acid | CHEMBL125770
Type:
Small organic molecule
Emp. Form.:
C22H31N3O5
Mol. Mass.:
417.4986
SMILES:
COc1cccc(c1)C(=O)NC(CCC(O)=O)C(=O)NN1CCC2(CCCC2)CC1
: