Target
Gastrin/cholecystokinin type B receptor
Ligand
BDBM50008180
Substrate
Meas. Tech.
ChEBML_216728
IC50
200±n/a nM
Citation
 Makovec, FPeris, WRevel, LGiovanetti, RMennuni, LRovati, LC Structure-antigastrin activity relationships of new (R)-4-benzamido-5-oxopentanoic acid derivatives. J Med Chem 35:28-38 (1992)  
Target
Name:
Gastrin/cholecystokinin type B receptor
Synonyms:
Cckbr Cholecystokinin B receptor GASR_RAT | Gastrin/cholecystokinin type B receptor
Type:
Enzyme Catalytic Domain
Mol. Mass.:
48980.43
Organism:
RAT
Description:
Cholecystokinin A CCKBR RAT::P30553
Residue:
452
  
Inhibitor
Name:
BDBM50008180
Synonyms:
4-(3-Aza-spiro[5.5]undec-3-ylcarbamoyl)-4-[(naphthalene-2-carbonyl)-amino]-butyric acid | CHEMBL125925
Type:
Small organic molecule
Emp. Form.:
C26H33N3O4
Mol. Mass.:
451.5579
SMILES:
OC(=O)CCC(NC(=O)c1ccc2ccccc2c1)C(=O)NN1CCC2(CCCCC2)CC1
: