Target
Cholecystokinin receptor type A
Ligand
BDBM50008207
Substrate
Meas. Tech.
ChEBML_50058
IC50
400±n/a nM
Citation
 Makovec, FPeris, WRevel, LGiovanetti, RMennuni, LRovati, LC Structure-antigastrin activity relationships of new (R)-4-benzamido-5-oxopentanoic acid derivatives. J Med Chem 35:28-38 (1992)  
Target
Name:
Cholecystokinin receptor type A
Synonyms:
CCKAR_RAT Cholecystokinin peripheral Cholecystokinin receptor type A
Type:
Enzyme Catalytic Domain
Mol. Mass.:
49676.37
Organism:
RAT
Description:
Cholecystokinin central 0 RAT::P30551
Residue:
444
  
Inhibitor
Name:
BDBM50008207
Synonyms:
4-(3-Aza-spiro[5.5]undec-3-ylcarbamoyl)-4-[(quinoline-3-carbonyl)-amino]-butyric acid | CHEMBL334171
Type:
Small organic molecule
Emp. Form.:
C25H32N4O4
Mol. Mass.:
452.546
SMILES:
OC(=O)CCC(NC(=O)c1cnc2ccccc2c1)C(=O)NN1CCC2(CCCCC2)CC1
: