Target
Gastrin/cholecystokinin type B receptor
Ligand
BDBM50008208
Substrate
Meas. Tech.
ChEBML_216728
IC50
6000±n/a nM
Citation
 Makovec, FPeris, WRevel, LGiovanetti, RMennuni, LRovati, LC Structure-antigastrin activity relationships of new (R)-4-benzamido-5-oxopentanoic acid derivatives. J Med Chem 35:28-38 (1992)  
Target
Name:
Gastrin/cholecystokinin type B receptor
Synonyms:
Cckbr Cholecystokinin B receptor GASR_RAT | Gastrin/cholecystokinin type B receptor
Type:
Enzyme Catalytic Domain
Mol. Mass.:
48980.43
Organism:
RAT
Description:
Cholecystokinin A CCKBR RAT::P30553
Residue:
452
  
Inhibitor
Name:
BDBM50008208
Synonyms:
4-(3,5-Dichloro-benzoylamino)-4-(spiro[5.5]undec-3-ylcarbamoyl)-butyric acid | CHEMBL124805
Type:
Small organic molecule
Emp. Form.:
C23H30Cl2N2O4
Mol. Mass.:
469.401
SMILES:
OC(=O)CCC(NC(=O)c1cc(Cl)cc(Cl)c1)C(=O)NC1CCC2(CCCCC2)CC1
: