Target
D(1A) dopamine receptor
Ligand
BDBM50004797
Substrate
Meas. Tech.
ChEBML_60355
Ki
4.1±n/a nM
Citation
 Baindur, NTran, MNiznik, HBGuan, HCSeeman, PNeumeyer, JL (+/-)-3-allyl-7-halo-8-hydroxy-1-phenyl-2,3,4,5-tetrahydro-1H-3-benzazepines as selective high affinity D1 dopamine receptor antagonists: synthesis and structure-activity relationship. J Med Chem 35:67-72 (1992)  
Target
Name:
D(1A) dopamine receptor
Synonyms:
DA D1 receptor DRD1 Dopamine D1 receptor Dopamine D1A
Type:
Enzyme
Mol. Mass.:
49303.43
Organism:
Homo sapiens (Human)
Description:
P21728
Residue:
446
  
Inhibitor
Name:
BDBM50004797
Synonyms:
8-Bromo-5-phenyl-2,3,4,5-tetrahydro-1H-benzo[d]azepin-7-ol; hydrobromide | CHEMBL557799
Type:
Small organic molecule
Emp. Form.:
C16H16BrNO
Mol. Mass.:
318.208
SMILES:
Oc1cc2C(CNCCc2cc1Br)c1ccccc1
: