Target
D(2) dopamine receptor
Ligand
BDBM50004796
Substrate
Meas. Tech.
ChEMBL_58207 (CHEMBL672778)
Ki
1374±n/a nM
Citation
 Baindur, NTran, MNiznik, HBGuan, HCSeeman, PNeumeyer, JL (+/-)-3-allyl-7-halo-8-hydroxy-1-phenyl-2,3,4,5-tetrahydro-1H-3-benzazepines as selective high affinity D1 dopamine receptor antagonists: synthesis and structure-activity relationship. J Med Chem 35:67-72 (1992)  
Target
Name:
D(2) dopamine receptor
Synonyms:
D(2) dopamine receptor DOPAMINE D2 Long DRD2 Dopamine D2 receptor Dopamine D2 receptor (D2R) Dopamine2-like | d2
Type:
Cell-surface receptors
Mol. Mass.:
50647.10
Organism:
Homo sapiens (Human)
Description:
P14416
Residue:
443
  
Inhibitor
Name:
BDBM50004796
Synonyms:
8-Chloro-5-phenyl-2,3,4,5-tetrahydro-1H-benzo[d]azepin-7-ol; hydrobromide CHEMBL540857
Type:
Small organic molecule
Emp. Form.:
C16H16ClNO
Mol. Mass.:
273.757
SMILES:
Oc1cc2C(CNCCc2cc1Cl)c1ccccc1
: