Target
Thermolysin
Ligand
BDBM50006114
Substrate
Meas. Tech.
ChEBML_210389
Ki
430±n/a nM
Citation
 Bohacek, RSMcMartin, C Definition and display of steric, hydrophobic, and hydrogen-bonding properties of ligand binding sites in proteins using Lee and Richards accessible surface: validation of a high-resolution graphical tool for drug design. J Med Chem 35:1671-84 (1992)  
Target
Name:
Thermolysin
Synonyms:
THER_BACTH | npr
Type:
PROTEIN
Mol. Mass.:
60097.54
Organism:
Bacillus thermoproteolyticus
Description:
ChEMBL_1468794
Residue:
548
  
Inhibitor
Name:
BDBM50006114
Synonyms:
(HONH-BAGN) N-(1-{[(4-Nitro-phenylcarbamoyl)-methyl]-carbamoyl}-ethyl)-3-oxo-4-phenyl-butyramide | CHEMBL45212
Type:
Small organic molecule
Emp. Form.:
C21H22N4O6
Mol. Mass.:
426.4226
SMILES:
C[C@H](NC(=O)CC(=O)Cc1ccccc1)C(=O)NCC(=O)Nc1ccc(cc1)[N+]([O-])=O
: