Target
Sodium-dependent dopamine transporter
Ligand
BDBM50005546
Substrate
Meas. Tech.
ChEBML_61999
IC50
248±n/a nM
Citation
 Carroll, FIGao, YAbraham, PLewin, AHLew, RPatel, ABoja, JWKuhar, MJ Probes for the cocaine receptor. Potentially irreversible ligands for the dopamine transporter. J Med Chem 35:1813-7 (1992)  
Target
Name:
Sodium-dependent dopamine transporter
Synonyms:
DA transporter SC6A3_RAT Sodium-dependent dopamine transporter | Sodium-dependent dopamine transporter (DAT)
Type:
Multi-pass membrane protein
Mol. Mass.:
68749.45
Organism:
Rattus norvegicus (rat)
Description:
P23977
Residue:
619
  
Inhibitor
Name:
BDBM50005546
Synonyms:
3-Benzoyloxy-8-methyl-8-aza-bicyclo[3.2.1]octane-2-carboxylic acid phenethyl ester | CHEMBL262308
Type:
Small organic molecule
Emp. Form.:
C24H27NO4
Mol. Mass.:
393.4755
SMILES:
CN1[C@@H]2CCC1C([C@H](C2)OC(=O)c1ccccc1)C(=O)OCCc1ccccc1
: