Target
Gastrin/cholecystokinin type B receptor
Ligand
BDBM50002511
Substrate
Meas. Tech.
ChEBML_47971
IC50
4700±n/a nM
Citation
 Shiosaki, KLin, CWKopecka, HCraig, RABianchi, BRMiller, TRWitte, DGStashko, MNadzan, AM Development of potent and selective CCK-A receptor agonists from Boc-CCK-4: tetrapeptides containing Lys(N epsilon)-amide residues. J Med Chem 35:2007-14 (1992)  
Target
Name:
Gastrin/cholecystokinin type B receptor
Synonyms:
CCK-2 receptor CCK-BR CCKRB Cholecystokinin receptor GASR_HUMAN | Gastrin/cholecystokinin type B receptor
Type:
G Protein-Coupled Receptor (GPCR)
Mol. Mass.:
48445.79
Organism:
Homo sapiens (Human)
Description:
Stable expression of human CCK-2 receptors in HEK 293 cells.
Residue:
447
  
Inhibitor
Name:
BDBM50002511
Synonyms:
3-[2-[2-tert-Butoxycarbonylamino-3-(1H-indol-3-yl)-propionylamino]-6-(3-1H-indol-3-yl-acryloylamino)-hexanoylamino]-N-(1-carbamoyl-2-phenyl-ethyl)-succinamic acid; hydrate | CHEMBL294304
Type:
Small organic molecule
Emp. Form.:
C46H54N8O9
Mol. Mass.:
862.9692
SMILES:
CC(C)(C)OC(=O)N[C@@H](Cc1c[nH]c2ccccc12)C(=O)N[C@@H](CCCCNC(=O)C=Cc1c[nH]c2ccccc12)C(=O)N[C@@H](CC(O)=O)C(=O)N[C@@H](Cc1ccccc1)C(N)=O
: