Target
Substance-P receptor
Ligand
BDBM50002567
Substrate
Meas. Tech.
ChEBML_205411
IC50
100000±n/a nM
Citation
 Hagiwara, DMiyake, HMorimoto, HMurai, MFujii, TMatsuo, M Studies on neurokinin antagonists. 1. The design of novel tripeptides possessing the glutaminyl-D-tryptophylphenylalanine sequence as substance P antagonists. J Med Chem 35:2015-25 (1992)  
Target
Name:
Substance-P receptor
Synonyms:
NK1R_CAVPO Neurokinin NK1 TACR1
Type:
Enzyme Catalytic Domain
Mol. Mass.:
46261.42
Organism:
GUINEA PIG
Description:
Neurokinin NK1 TACR1 GUINEA PIG::P30547
Residue:
407
  
Inhibitor
Name:
BDBM50002567
Synonyms:
2-[1-[1-amino-2-(1H-3-indolyl)-(1R)-ethylcarboxamido]-2-phenyl-(1S)-ethylcarboxamido]-3-(1H-3-indolyl)-(2R)-propanoic acid | CHEMBL64601
Type:
Small organic molecule
Emp. Form.:
C31H31N5O4
Mol. Mass.:
537.6089
SMILES:
N[C@H](Cc1c[nH]c2ccccc12)C(=O)N[C@@H](Cc1ccccc1)C(=O)N[C@H](Cc1c[nH]c2ccccc12)C(O)=O
: