Target
Aldo-keto reductase family 1 member B1
Ligand
BDBM50006494
Substrate
Meas. Tech.
ChEBML_31757
IC50
95500±n/a nM
Citation
 Lipinski, CAAldinger, CEBeyer, TABordner, JBurdi, DFBussolotti, DLInskeep, PBSiegel, TW Hydantoin bioisosteres. In vivo active spiro hydroxy acetic acid aldose reductase inhibitors. J Med Chem 35:2169-77 (1992)  
Target
Name:
Aldo-keto reductase family 1 member B1
Synonyms:
AKR1B1 ALDR_HUMAN AR Aldose Reductase (ALR2) Aldose reductase (AR)
Type:
Protein
Mol. Mass.:
35855.50
Organism:
Homo sapiens (Human)
Description:
P15121. 4LAU; 2IKI; 4LB4; 2FZD; 2FZ8; 1US0
Residue:
316
  
Inhibitor
Name:
BDBM50006494
Synonyms:
(6-Chloro-4-hydroxy-2-methyl-5-nitro-chroman-4-yl)-acetic acid | CHEMBL68624
Type:
Small organic molecule
Emp. Form.:
C12H12ClNO6
Mol. Mass.:
301.68
SMILES:
C[C@@H]1C[C@@](O)(CC(O)=O)c2c(O1)ccc(Cl)c2[N+]([O-])=O
: