Target
Aldo-keto reductase family 1 member B1
Ligand
BDBM50006513
Substrate
Meas. Tech.
ChEBML_31757
IC50
190±n/a nM
Citation
 Lipinski, CAAldinger, CEBeyer, TABordner, JBurdi, DFBussolotti, DLInskeep, PBSiegel, TW Hydantoin bioisosteres. In vivo active spiro hydroxy acetic acid aldose reductase inhibitors. J Med Chem 35:2169-77 (1992)  
Target
Name:
Aldo-keto reductase family 1 member B1
Synonyms:
AKR1B1 ALDR_HUMAN AR Aldose Reductase (ALR2) Aldose reductase (AR)
Type:
Protein
Mol. Mass.:
35855.50
Organism:
Homo sapiens (Human)
Description:
P15121. 4LAU; 2IKI; 4LB4; 2FZD; 2FZ8; 1US0
Residue:
316
  
Inhibitor
Name:
BDBM50006513
Synonyms:
(6-Chloro-4-hydroxy-7-methoxy-2-methyl-chroman-4-yl)-acetic acid | CHEMBL68992
Type:
Small organic molecule
Emp. Form.:
C13H15ClO5
Mol. Mass.:
286.708
SMILES:
COc1cc2O[C@H](C)C[C@@](O)(CC(O)=O)c2cc1Cl
: