Target
Aldo-keto reductase family 1 member B1
Ligand
BDBM50006517
Substrate
Meas. Tech.
ChEBML_31757
IC50
1920±n/a nM
Citation
 Lipinski, CAAldinger, CEBeyer, TABordner, JBurdi, DFBussolotti, DLInskeep, PBSiegel, TW Hydantoin bioisosteres. In vivo active spiro hydroxy acetic acid aldose reductase inhibitors. J Med Chem 35:2169-77 (1992)  
Target
Name:
Aldo-keto reductase family 1 member B1
Synonyms:
AKR1B1 ALDR_HUMAN AR Aldose Reductase (ALR2) Aldose reductase (AR)
Type:
Protein
Mol. Mass.:
35855.50
Organism:
Homo sapiens (Human)
Description:
P15121. 4LAU; 2IKI; 4LB4; 2FZD; 2FZ8; 1US0
Residue:
316
  
Inhibitor
Name:
BDBM50006517
Synonyms:
(7-Fluoro-9-hydroxy-1,2,3,3a,9,9a-hexahydro-cyclopenta[b]chromen-9-yl)-acetic acid | CHEMBL67751
Type:
Small organic molecule
Emp. Form.:
C14H15FO4
Mol. Mass.:
266.2649
SMILES:
OC(=O)C[C@]1(O)[C@H]2CCC[C@H]2Oc2ccc(F)cc12
: