Target
Aldo-keto reductase family 1 member B1
Ligand
BDBM50006535
Substrate
Meas. Tech.
ChEBML_31757
IC50
400±n/a nM
Citation
 Lipinski, CAAldinger, CEBeyer, TABordner, JBurdi, DFBussolotti, DLInskeep, PBSiegel, TW Hydantoin bioisosteres. In vivo active spiro hydroxy acetic acid aldose reductase inhibitors. J Med Chem 35:2169-77 (1992)  
Target
Name:
Aldo-keto reductase family 1 member B1
Synonyms:
AKR1B1 ALDR_HUMAN AR Aldose Reductase (ALR2) Aldose reductase (AR)
Type:
Protein
Mol. Mass.:
35855.50
Organism:
Homo sapiens (Human)
Description:
P15121. 4LAU; 2IKI; 4LB4; 2FZD; 2FZ8; 1US0
Residue:
316
  
Inhibitor
Name:
BDBM50006535
Synonyms:
(6-Chloro-4-hydroxy-2-methyl-3,4-dihydro-2H-benzo[h]chromen-4-yl)-acetic acid | CHEMBL421111
Type:
Small organic molecule
Emp. Form.:
C16H15ClO4
Mol. Mass.:
306.741
SMILES:
C[C@@H]1C[C@@](O)(CC(O)=O)c2cc(Cl)c3ccccc3c2O1
: