Target
Delta-type opioid receptor
Ligand
BDBM50000781
Substrate
Meas. Tech.
ChEBML_146435
Ki
12300±n/a nM
Citation
 Cheng, CYWu, SCHsin, LWTam, SW Selective reversible and irreversible ligands for the kappa opioid receptor. J Med Chem 35:2243-7 (1992)  
Target
Name:
Delta-type opioid receptor
Synonyms:
D-OR-1 Delta opioid receptor OPIATE Delta OPRD1 OPRK1 | opioid receptor, delta 1
Type:
G Protein-Coupled Receptor (GPCR)
Mol. Mass.:
40382.98
Organism:
Homo sapiens (Human)
Description:
Competition binding assays were carried out using membrane preparations from transfected HN9.10 cells that constitutively expressed the delta opioid receptor.
Residue:
372
  
Inhibitor
Name:
BDBM50000781
Synonyms:
2-(3,4-Dichloro-phenyl)-N-methyl-N-(3-methylene-2-oxo-8-pyrrolidin-1-yl-1-oxa-spiro[4.5]dec-7-yl)-acetamide | CHEMBL70311
Type:
Small organic molecule
Emp. Form.:
C23H28Cl2N2O3
Mol. Mass.:
451.386
SMILES:
CN([C@H]1C[C@]2(CC(=C)C(=O)O2)CC[C@@H]1N1CCCC1)C(=O)Cc1ccc(Cl)c(Cl)c1
: