Target
Adenosine receptor A1
Ligand
BDBM50119168
Substrate
Meas. Tech.
ChEMBL_29158 (CHEMBL637707)
Ki
13±n/a nM
Citation
 Cristalli, GEleuteri, AVittori, SVolpini, RLohse, MJKlotz, KN 2-Alkynyl derivatives of adenosine and adenosine-5'-N-ethyluronamide as selective agonists at A2 adenosine receptors. J Med Chem 35:2363-8 (1992)  
Target
Name:
Adenosine receptor A1
Synonyms:
AA1R_RAT ADENOSINE A1 high Adenosine A1 receptor (A1) Adenosine receptors A1 | Adora1
Type:
Protein
Mol. Mass.:
36704.13
Organism:
Rattus norvegicus (rat)
Description:
Residue:
326
  
Inhibitor
Name:
BDBM50119168
Synonyms:
(2R,3R,4S,5R)-2-(6-Amino-2-hex-1-ynyl-purin-9-yl)-5-hydroxymethyl-tetrahydro-furan-3,4-diol (2R,3R,4S,5R)-2-(6-amino-2-(hex-1-ynyl)-9H-purin-9-yl)-5-(hydroxymethyl)tetrahydrofuran-3,4-diol CHEMBL319387
Type:
Small organic molecule
Emp. Form.:
C16H21N5O4
Mol. Mass.:
347.369
SMILES:
CCCCC#Cc1nc(N)c2ncn([C@@H]3O[C@H](CO)[C@@H](O)[C@H]3O)c2n1
: