Target
Adenosine receptor A1
Ligand
BDBM50453222
Substrate
Meas. Tech.
ChEMBL_29627 (CHEMBL636645)
Ki
1620±n/a nM
Citation
 Cristalli, GEleuteri, AVittori, SVolpini, RLohse, MJKlotz, KN 2-Alkynyl derivatives of adenosine and adenosine-5'-N-ethyluronamide as selective agonists at A2 adenosine receptors. J Med Chem 35:2363-8 (1992)  
Target
Name:
Adenosine receptor A1
Synonyms:
AA1R_RAT ADENOSINE A1 high Adenosine A1 receptor (A1) Adenosine receptors A1 | Adora1
Type:
Protein
Mol. Mass.:
36704.13
Organism:
Rattus norvegicus (rat)
Description:
Residue:
326
  
Inhibitor
Name:
BDBM50453222
Synonyms:
CHEMBL2113509
Type:
Small organic molecule
Emp. Form.:
C17H22N6O4
Mol. Mass.:
374.3944
SMILES:
CCCC#Cc1nc(N)c2ncn([C@@H]3O[C@@H]([C@@H](O)[C@H]3O)C(=O)NCC)c2n1
: