Target
Adenosine receptor A2a/A2b
Ligand
BDBM50453216
Substrate
Meas. Tech.
ChEMBL_27783 (CHEMBL645919)
Ki
40±n/a nM
Citation
 Cristalli, GEleuteri, AVittori, SVolpini, RLohse, MJKlotz, KN 2-Alkynyl derivatives of adenosine and adenosine-5'-N-ethyluronamide as selective agonists at A2 adenosine receptors. J Med Chem 35:2363-8 (1992)  
Target
Name:
Adenosine receptor A2a/A2b
Synonyms:
Adenosine A2 receptor
Type:
Mol. Mass.:
Description:
ASSAY_ID of ChEMBL is 329906
Components:
This complex has 2 components.
Component 1
Name:
Adenosine receptor A2b
Synonyms:
AA2BR_HUMAN ADORA2B Adenosine receptors A2b | Adenosine receptors; A2a & A2b
Type:
G Protein-Coupled Receptor (GPCR)
Mol. Mass.:
36341.22
Organism:
Homo sapiens (Human)
Description:
Residue:
332
  
Component 2
Name:
Adenosine receptor A2a
Synonyms:
A2A adenosine receptor (hA2A) ADENOSINE A2 ADORA2 Adenosine A2A receptor (A2AAR)
Type:
G Protein-Coupled Receptor (GPCR)
Mol. Mass.:
44716.46
Organism:
Homo sapiens (Human)
Description:
P29274
Residue:
412
  
Inhibitor
Name:
BDBM50453216
Synonyms:
2-(l-hexyn-l-yl)adenosine (8, YT-146) | CHEMBL2113496
Type:
Small organic molecule
Emp. Form.:
C18H25N5O4
Mol. Mass.:
375.4222
SMILES:
CCCCCCC#Cc1nc(N)c2ncn([C@@H]3O[C@H](CO)[C@@H](O)[C@H]3O)c2n1
: