Target
Delta-type opioid receptor
Ligand
BDBM50000789
Substrate
Meas. Tech.
ChEBML_146873
IC50
19±n/a nM
Citation
 Dasher, WEKlein, PNelson, WL Electrophilic opioid ligands. Oxygen tethered alpha-methylene-gamma-lactone, acrylate, isothiocyanate, and epoxide derivatives of 6 beta-naltrexol. J Med Chem 35:2374-84 (1992)  
Target
Name:
Delta-type opioid receptor
Synonyms:
D-OR-1 Delta opioid receptor OPIATE Delta OPRD1 OPRK1 | opioid receptor, delta 1
Type:
G Protein-Coupled Receptor (GPCR)
Mol. Mass.:
40382.98
Organism:
Homo sapiens (Human)
Description:
Competition binding assays were carried out using membrane preparations from transfected HN9.10 cells that constitutively expressed the delta opioid receptor.
Residue:
372
  
Inhibitor
Name:
BDBM50000789
Synonyms:
5-[4-cyclopropylmethyl-10,17-dihydroxy-12-oxa-4-azapentacyclo[9.6.1.01,13.05,17.07,18]octadeca-7(18),8,10-trien-14-yloxymethyl]-3-methylenetetrahydro-2-furanone | CHEMBL80531
Type:
Small organic molecule
Emp. Form.:
C26H31NO6
Mol. Mass.:
453.5274
SMILES:
Oc1ccc2C[C@H]3N(CC4CC4)CC[C@@]45[C@@H](Oc1c24)[C@@H](CC[C@@]35O)OC[C@@H]1CC(=C)C(=O)O1
: