Target
Mu-type opioid receptor
Ligand
BDBM50000798
Substrate
Meas. Tech.
ChEBML_146239
IC50
2.2±n/a nM
Citation
 Dasher, WEKlein, PNelson, WL Electrophilic opioid ligands. Oxygen tethered alpha-methylene-gamma-lactone, acrylate, isothiocyanate, and epoxide derivatives of 6 beta-naltrexol. J Med Chem 35:2374-84 (1992)  
Target
Name:
Mu-type opioid receptor
Synonyms:
M-OR-1 Mu opioid receptor OPIATE Mu OPRM_CAVPO
Type:
Enzyme Catalytic Domain
Mol. Mass.:
11165.58
Organism:
GUINEA PIG
Description:
P97266
Residue:
98
  
Inhibitor
Name:
BDBM50000798
Synonyms:
4-cyclopropylmethyl-10-hydroxy-14-(4-methylene-5-oxotetrahydro-2-furanylmethoxy)-12-oxa-4-azapentacyclo[9.6.1.01,13.05,17.07,18]octadeca-7(18),8,10-trien-17-yl acetate | CHEMBL78932
Type:
Small organic molecule
Emp. Form.:
C28H33NO7
Mol. Mass.:
495.5641
SMILES:
CC(=O)O[C@]12CC[C@@H](OC[C@H]3CC(=C)C(=O)O3)[C@@H]3Oc4c5c(C[C@H]1N(CC1CC1)CC[C@@]235)ccc4O
: