Target
Sodium-dependent dopamine transporter
Ligand
BDBM50006785
Substrate
Meas. Tech.
ChEBML_61852
IC50
2±n/a nM
Citation
 Carroll, FIAbraham, PLewin, AHParham, KABoja, JWKuhar, M Isopropyl and phenyl esters of 3 beta-(4-substituted phenyl)tropan-2 beta-carboxylic acids. Potent and selective compounds for the dopamine transporter. J Med Chem 35:2497-500 (1992)  
Target
Name:
Sodium-dependent dopamine transporter
Synonyms:
DA transporter SC6A3_RAT Sodium-dependent dopamine transporter | Sodium-dependent dopamine transporter (DAT)
Type:
Multi-pass membrane protein
Mol. Mass.:
68749.45
Organism:
Rattus norvegicus (rat)
Description:
P23977
Residue:
619
  
Inhibitor
Name:
BDBM50006785
Synonyms:
3-(4-Chloro-phenyl)-8-methyl-8-aza-bicyclo[3.2.1]octane-2-carboxylic acid phenyl ester | CHEMBL310573
Type:
Small organic molecule
Emp. Form.:
C21H22ClNO2
Mol. Mass.:
355.858
SMILES:
CN1[C@@H]2CCC1[C@H]([C@H](C2)c1ccc(Cl)cc1)C(=O)Oc1ccccc1
: