Target
Sodium-dependent serotonin transporter
Ligand
BDBM50006784
Substrate
Meas. Tech.
ChEBML_201636
IC50
310±n/a nM
Citation
 Carroll, FIAbraham, PLewin, AHParham, KABoja, JWKuhar, M Isopropyl and phenyl esters of 3 beta-(4-substituted phenyl)tropan-2 beta-carboxylic acids. Potent and selective compounds for the dopamine transporter. J Med Chem 35:2497-500 (1992)  
Target
Name:
Sodium-dependent serotonin transporter
Synonyms:
5-HT Transporter 5HT transporter Anandamid membrane transporter, AMT Monoamine transporters; Norepinephrine & serotonin Slc6a4 Sodium-dependent serotonin transporter (SERT) | imipramine receptor
Type:
Multi-pass membrane protein
Mol. Mass.:
70168.43
Organism:
Rattus norvegicus (rat)
Description:
P31652
Residue:
630
  
Inhibitor
Name:
BDBM50006784
Synonyms:
3-(4-Iodo-phenyl)-8-methyl-8-aza-bicyclo[3.2.1]octane-2-carboxylic acid isopropyl ester RTI-121
Type:
Small organic molecule
Emp. Form.:
C18H24INO2
Mol. Mass.:
413.2931
SMILES:
CC(C)OC(=O)[C@@H]1C2CC[C@H](C[C@@H]1c1ccc(I)cc1)N2C
: