Target
Transporter
Ligand
BDBM50006781
Substrate
Meas. Tech.
ChEMBL_142625 (CHEMBL751162)
IC50
44±n/a nM
Citation
 Carroll, FIAbraham, PLewin, AHParham, KABoja, JWKuhar, M Isopropyl and phenyl esters of 3 beta-(4-substituted phenyl)tropan-2 beta-carboxylic acids. Potent and selective compounds for the dopamine transporter. J Med Chem 35:2497-500 (1992)  
Target
Name:
Transporter
Synonyms:
Monoamine transporters; Norepininephrine & dopamine | Norepinephrine Monoamine transporters
Type:
PROTEIN
Mol. Mass.:
66787.87
Organism:
Rattus norvegicus
Description:
ChEMBL_1463061
Residue:
597
  
Inhibitor
Name:
BDBM50006781
Synonyms:
(2S,3S)-methyl 8-methyl-3-p-tolyl-8-aza-bicyclo[3.2.1]octane-2-carboxylate 8-Methyl-3-p-tolyl-8-aza-bicyclo[3.2.1]octane-2-carboxylic acid methyl ester | CHEMBL312037
Type:
Small organic molecule
Emp. Form.:
C17H23NO2
Mol. Mass.:
273.37
SMILES:
COC(=O)[C@@H]1C2CC[C@H](C[C@@H]1c1ccc(C)cc1)N2C
: