Target
Prostaglandin G/H synthase 1/2
Ligand
BDBM50006804
Substrate
Meas. Tech.
ChEMBL_158284 (CHEMBL764934)
IC50
5820±n/a nM
Citation
 Musser, JHKreft, AF 5-lipoxygenase: properties, pharmacology, and the quinolinyl(bridged)aryl class of inhibitors. J Med Chem 35:2501-24 (1992)  
Target
Name:
Prostaglandin G/H synthase 1/2
Synonyms:
Cyclooxygenase
Type:
Mol. Mass.:
Description:
ASSAY_ID of ChEMBL is 1666355
Components:
This complex has 2 components.
Component 1
Name:
Prostaglandin G/H synthase 2
Synonyms:
Cox-2 Cyclooxygenase Ptgs2
Type:
Enzyme Catalytic Domain
Mol. Mass.:
69173.51
Organism:
RAT
Description:
COX-2 0 RAT::P35355
Residue:
604
  
Component 2
Name:
Prostaglandin G/H synthase 1
Synonyms:
Cox-1 Cyclooxygenase PGH1_RAT Ptgs1
Type:
Enzyme Catalytic Domain
Mol. Mass.:
69033.56
Organism:
RAT
Description:
COX-1 0 RAT::Q63921
Residue:
602
  
Inhibitor
Name:
BDBM50006804
Synonyms:
2-(Quinolin-2-ylmethoxy)-phenol | CHEMBL84074
Type:
Small organic molecule
Emp. Form.:
C16H13NO2
Mol. Mass.:
251.2799
SMILES:
Oc1ccccc1OCc1ccc2ccccc2n1
: