Target
Polyunsaturated fatty acid 5-lipoxygenase
Ligand
BDBM50006805
Substrate
Meas. Tech.
ChEMBL_3835 (CHEMBL618019)
IC50
60±n/a nM
Citation
 Musser, JHKreft, AF 5-lipoxygenase: properties, pharmacology, and the quinolinyl(bridged)aryl class of inhibitors. J Med Chem 35:2501-24 (1992)  
Target
Name:
Polyunsaturated fatty acid 5-lipoxygenase
Synonyms:
5-LO 5-Lipoxygenase (5-LO) 5-Lipoygenase ALOX5 LOG5 | LOX5_HUMAN
Type:
Enzyme
Mol. Mass.:
77972.74
Organism:
Homo sapiens (Human)
Description:
Recombinant protein was purified from E. coli lysate. After ammonium sulfate precipitation and subsequent steps, the supernatant (S100) was used for 5-LO activity assay.
Residue:
674
  
Inhibitor
Name:
BDBM50006805
Synonyms:
3-(1-(4-chlorobenzyl)-3-(tert-butylthio)-5-isopropyl-1H-indol-2-yl)-2,2-dimethylpropanoic acid 3-[1-(4-chlorobenzyl)-3-t-butyl-thio-5-isopropylindol-2-yl]-2,2-dimethylpropanoic acid CHEMBL29097 MK886 | cid_3651377
Type:
Small organic molecule
Emp. Form.:
C27H34ClNO2S
Mol. Mass.:
472.082
SMILES:
CC(C)c1ccc2n(Cc3ccc(Cl)cc3)c(CC(C)(C)C(O)=O)c(SC(C)(C)C)c2c1
: