Target
Cathepsin D
Ligand
BDBM50006853
Substrate
Meas. Tech.
ChEMBL_44968 (CHEMBL662698)
IC50
35±n/a nM
Citation
 Patt, WCHamilton, HWTaylor, MDRyan, MJTaylor, DGConnolly, CJDoherty, AMKlutchko, SRSircar, ISteinbaugh, BA Structure-activity relationships of a series of 2-amino-4-thiazole-containing renin inhibitors. J Med Chem 35:2562-72 (1992)  
Target
Name:
Cathepsin D
Synonyms:
CATD_BOVIN | CTSD
Type:
PROTEIN
Mol. Mass.:
42158.92
Organism:
Bos taurus
Description:
ChEMBL_1458606
Residue:
387
  
Inhibitor
Name:
BDBM50006853
Synonyms:
CHEMBL315211 | N-(1-Cyclohexylmethyl-2,3-dihydroxy-5-methyl-hexyl)-2-[2-(morpholine-4-sulfonylamino)-3-phenyl-propionylamino]-malonamic acid methyl ester
Type:
Small organic molecule
Emp. Form.:
C31H50N4O9S
Mol. Mass.:
654.815
SMILES:
COC(=O)[C@H](NC(=O)[C@H](Cc1ccccc1)NS(=O)(=O)N1CCOCC1)C(=O)N[C@@H](CC1CCCCC1)[C@@H](O)[C@@H](O)CC(C)C
: