Target
Gastrin/cholecystokinin type B receptor
Ligand
BDBM50455596
Substrate
Meas. Tech.
ChEMBL_48250 (CHEMBL661839)
IC50
1.7±n/a nM
Citation
 Drysdale, MJPritchard, MCHorwell, DC Rationally designed"dipeptoid" analogues of CCK. Acid mimics of the potent and selective non-peptide CCK-B receptor antagonist CI-988. J Med Chem 35:2573-81 (1992)  
Target
Name:
Gastrin/cholecystokinin type B receptor
Synonyms:
Cckbr Cholecystokinin receptor Gastrin/cholecystokinin type B receptor
Type:
Enzyme Catalytic Domain
Mol. Mass.:
49196.59
Organism:
MOUSE
Description:
Cholecystokinin A CCKBR MOUSE::P56481
Residue:
453
  
Inhibitor
Name:
BDBM50455596
Synonyms:
CHEMBL2112336
Type:
Small organic molecule
Emp. Form.:
C35H41N7O5S
Mol. Mass.:
671.809
SMILES:
[H][C@](CNC(=O)[C@](C)(Cc1c[nH]c2ccccc12)NC(=O)OC1C2CC3CC(C2)CC1C3)(NC(=O)C[S+]([O-])c1nc[nH]n1)c1ccccc1
: