Target
Cholecystokinin receptor type A
Ligand
BDBM50006868
Substrate
Meas. Tech.
ChEBML_49401
IC50
850±n/a nM
Citation
 Drysdale, MJPritchard, MCHorwell, DC Rationally designed"dipeptoid" analogues of CCK. Acid mimics of the potent and selective non-peptide CCK-B receptor antagonist CI-988. J Med Chem 35:2573-81 (1992)  
Target
Name:
Cholecystokinin receptor type A
Synonyms:
CCKAR_RAT Cholecystokinin peripheral Cholecystokinin receptor type A
Type:
Enzyme Catalytic Domain
Mol. Mass.:
49676.37
Organism:
RAT
Description:
Cholecystokinin central 0 RAT::P30551
Residue:
444
  
Inhibitor
Name:
BDBM50006868
Synonyms:
(2-(1H-Indol-3-yl)-1-methyl-1-{2-phenyl-2-[3-(2H-[1,2,4]triazol-3-ylsulfanyl)-propionylamino]-ethylcarbamoyl}-ethyl)-carbamic acid adamantan-2-yl ester (hydrate) | CHEMBL407857
Type:
Small organic molecule
Emp. Form.:
C36H43N7O4S
Mol. Mass.:
669.836
SMILES:
CC(Cc1c[nH]c2ccccc12)(NC(=O)OC1C2CC3CC(C2)CC1C3)C(=O)NC[C@@H](NC(=O)CCSc1nnc[nH]1)c1ccccc1
: