Target
Gastrin/cholecystokinin type B receptor
Ligand
BDBM50006877
Substrate
Meas. Tech.
ChEBML_48250
IC50
12±n/a nM
Citation
 Drysdale, MJPritchard, MCHorwell, DC Rationally designed"dipeptoid" analogues of CCK. Acid mimics of the potent and selective non-peptide CCK-B receptor antagonist CI-988. J Med Chem 35:2573-81 (1992)  
Target
Name:
Gastrin/cholecystokinin type B receptor
Synonyms:
Cckbr Cholecystokinin receptor Gastrin/cholecystokinin type B receptor
Type:
Enzyme Catalytic Domain
Mol. Mass.:
49196.59
Organism:
MOUSE
Description:
Cholecystokinin A CCKBR MOUSE::P56481
Residue:
453
  
Inhibitor
Name:
BDBM50006877
Synonyms:
({2-[2-(Adamantan-2-yloxycarbonylamino)-3-(1H-indol-3-yl)-2-methyl-propionylamino]-1-phenyl-ethylcarbamoyl}-methyl)-phosphonic acid monoethyl ester (1.5 hydrate) | CHEMBL83244
Type:
Small organic molecule
Emp. Form.:
C35H45N4O7P
Mol. Mass.:
664.7282
SMILES:
CCOP(O)(=O)CC(=O)N[C@H](CNC(=O)C(C)(Cc1c[nH]c2ccccc12)NC(=O)OC1C2CC3CC(C2)CC1C3)c1ccccc1
: