Target
Polyunsaturated fatty acid 5-lipoxygenase
Ligand
BDBM50000829
Substrate
Meas. Tech.
ChEBML_3807
IC50
20±n/a nM
Citation
 Crawley, GCDowell, RIEdwards, PNFoster, SJMcMillan, RMWalker, ERWaterson, DBird, TGBruneau, PGiroaeau, JM Methoxytetrahydropyrans. A new series of selective and orally potent 5-lipoxygenase inhibitors. J Med Chem 35:2600-9 (1992)  
Target
Name:
Polyunsaturated fatty acid 5-lipoxygenase
Synonyms:
5-LO 5-Lipoxygenase (5-LO) 5-Lipoygenase ALOX5 LOG5 | LOX5_HUMAN
Type:
Enzyme
Mol. Mass.:
77972.74
Organism:
Homo sapiens (Human)
Description:
Recombinant protein was purified from E. coli lysate. After ammonium sulfate precipitation and subsequent steps, the supernatant (S100) was used for 5-LO activity assay.
Residue:
674
  
Inhibitor
Name:
BDBM50000829
Synonyms:
6-((3-fluoro-5-(4-methoxytetrahydro-2H-pyran-4-yl)phenoxy)methyl)-1-methylquinolin-2(1H)-one 6-[3-Fluoro-5-(tetrahydro-pyran-4-yl)-phenoxymethyl]-1-methyl-1H-quinolin-2-one ZD-2138
Type:
Small organic molecule
Emp. Form.:
C23H24FNO4
Mol. Mass.:
397.4394
SMILES:
COC1(CCOCC1)c1cc(F)cc(OCc2ccc3n(C)c(=O)ccc3c2)c1
: