Target
Thymidylate synthase
Ligand
BDBM50004379
Substrate
Meas. Tech.
ChEBML_209812
IC50
9000±n/a nM
Citation
 Warner, PBarker, AJJackman, ALBurrows, KDRoberts, NBishop, JAO'Connor, BMHughes, LR Quinoline antifolate thymidylate synthase inhibitors: variation of the C2- and C4-substituents. J Med Chem 35:2761-8 (1992)  
Target
Name:
Thymidylate synthase
Synonyms:
TS TYSY_MOUSE | Tyms
Type:
PROTEIN
Mol. Mass.:
34957.15
Organism:
Mus musculus
Description:
ChEMBL_1340097
Residue:
307
  
Inhibitor
Name:
BDBM50004379
Synonyms:
2-{4-[(4-Chloro-2-methoxy-quinolin-6-ylmethyl)-prop-2-ynyl-amino]-benzoylamino}-pentanedioic acid ; hydrate | CHEMBL328938
Type:
Small organic molecule
Emp. Form.:
C26H24ClN3O6
Mol. Mass.:
509.938
SMILES:
COc1cc(Cl)c2cc(CN(CC#C)c3ccc(cc3)C(=O)N[C@@H](CCC(O)=O)C(O)=O)ccc2n1
: