Target
Mu-type opioid receptor
Ligand
BDBM50001024
Substrate
Meas. Tech.
ChEBML_146540
Ki
470±n/a nM
Citation
 Carroll, FIAbraham, PParham, KBai, XZhang, XBrine, GAMascarella, SWMartin, BRMay, ELSauss, C Enantiomeric N-substituted N-normetazocines: a comparative study of affinities at sigma, PCP, and mu opioid receptors. J Med Chem 35:2812-8 (1992)  
Target
Name:
Mu-type opioid receptor
Synonyms:
MOR-1 Mu-type opioid receptor (MOR) OPRM_RAT Opioid receptor B Ror-b
Type:
G Protein-Coupled Receptor (GPCR)
Mol. Mass.:
44503.11
Organism:
Rattus norvegicus (rat)
Description:
Competition binding assays were carried out using membrane preparations from transfected HN9.10 cells that constitutively expressed the mu opioid receptor.
Residue:
398
  
Inhibitor
Name:
BDBM50001024
Synonyms:
6,11-Dimethyl-1,2,3,4,5,6-hexahydro-2,6-methano-benzo[d]azocin-8-ol | CHEMBL2367795
Type:
Small organic molecule
Emp. Form.:
C14H19NO
Mol. Mass.:
217.3068
SMILES:
[H][C@@]12Cc3ccc(O)cc3[C@](C)(CCN1)[C@@H]2C
: