Target
Adenosine receptor A2a/A2b
Ligand
BDBM50453224
Substrate
Meas. Tech.
ChEMBL_30703 (CHEMBL644778)
Ki
4.8±n/a nM
Citation
 Homma, HWatanabe, YAbiru, TMurayama, TNomura, YMatsuda, A Nucleosides and nucleotides. 112. 2-(1-Hexyn-1-yl)adenosine-5'-uronamides: a new entry of selective A2 adenosine receptor agonists with potent antihypertensive activity. J Med Chem 35:2881-90 (1992)  
Target
Name:
Adenosine receptor A2a/A2b
Synonyms:
Adenosine A2 receptor
Type:
Mol. Mass.:
Description:
ASSAY_ID of ChEMBL is 30560
Components:
This complex has 2 components.
Component 1
Name:
Adenosine receptor A2b
Synonyms:
AA2BR_RAT Adora2b
Type:
PROTEIN
Mol. Mass.:
36378.84
Organism:
Rattus norvegicus
Description:
ChEMBL_32934
Residue:
332
  
Component 2
Name:
Adenosine receptor A2a
Synonyms:
AA2AR_RAT Adenosine A2 receptor Adenosine Receptors A2a (A2a) Adenosine receptors A2a Rat striatal adenosine A2a receptor
Type:
G Protein-Coupled Receptor (GPCR)
Mol. Mass.:
45015.65
Organism:
Rattus norvegicus (rat)
Description:
Rat A2A receptors expressed in CHO cells.
Residue:
410
  
Inhibitor
Name:
BDBM50453224
Synonyms:
2-(l-hexyn-l-yl)-adenosine-5'-N-methyluronamide (16c) | CHEMBL410873
Type:
Small organic molecule
Emp. Form.:
C18H24N6O4
Mol. Mass.:
388.421
SMILES:
CCCCC#Cc1nc(N)c2ncn([C@@H]3O[C@@H]([C@@H](O)[C@H]3O)C(=O)NCC)c2n1
: