Target
Histamine H1 receptor
Ligand
BDBM50368370
Substrate
Meas. Tech.
ChEMBL_218827 (CHEMBL823938)
IC50
24000±n/a nM
Citation
 Diurno, MVMazzoni, OPiscopo, ECalignano, AGiordano, FBolognese, A Synthesis and antihistaminic activity of some thiazolidin-4-ones. J Med Chem 35:2910-2 (1992)  
Target
Name:
Histamine H1 receptor
Synonyms:
HISTAMINE H1 HRH1_CAVPO
Type:
G Protein-Coupled Receptor (GPCR)
Mol. Mass.:
55641.53
Organism:
Cavia porcellus (domestic guinea pig)
Description:
Guinea pig cerebellum was used in binding assay.
Residue:
488
  
Inhibitor
Name:
BDBM50368370
Synonyms:
CHEMBL1202939
Type:
Small organic molecule
Emp. Form.:
C14H19FN2OS
Mol. Mass.:
282.377
SMILES:
CN(C)CCCN1C(SCC1=O)c1ccc(F)cc1
: