Target
D(2) dopamine receptor
Ligand
BDBM50010617
Substrate
Meas. Tech.
ChEBML_58531
IC50
700±n/a nM
Citation
 Perrone, RBerardi, FLeopoldo, MTortorella, VLograno, MDDaniele, EGovoni, S Oxygen isosteric derivatives of 3-(3-hydroxyphenyl)-N-n-propylpiperidine. J Med Chem 35:3045-9 (1992)  
Target
Name:
D(2) dopamine receptor
Synonyms:
DOPAMINE D2 DOPAMINE D2 Short Dopamine D2 receptor Drd2
Type:
G Protein-Coupled Receptor (GPCR)
Mol. Mass.:
50931.60
Organism:
Rattus norvegicus (rat)
Description:
P61169
Residue:
444
  
Inhibitor
Name:
BDBM50010617
Synonyms:
(-)-3-(1-Propyl-piperidin-3-yl)-phenol 3-((S)-1-Propyl-piperidin-3-yl)-phenol 3PPP,(+) Preclamol
Type:
Small organic molecule
Emp. Form.:
C14H21NO
Mol. Mass.:
219.3226
SMILES:
CCCN1CCC[C@H](C1)c1cccc(O)c1
: