Target
Adenosine receptor A1
Ligand
BDBM50004562
Substrate
Meas. Tech.
ChEBML_29421
Ki
140±n/a nM
Citation
 Suzuki, FShimada, JMizumoto, HKarasawa, AKubo, KNonaka, HIshii, AKawakita, T Adenosine A1 antagonists. 2. Structure-activity relationships on diuretic activities and protective effects against acute renal failure. J Med Chem 35:3066-75 (1992)  
Target
Name:
Adenosine receptor A1
Synonyms:
A1 adenosine receptor ADENOSINE A1 ADENOSINE A1 low Adenosine A1 receptor | Adenosine Receptor A1
Type:
Enzyme Catalytic Domain
Mol. Mass.:
36501.39
Organism:
GUINEA PIG
Description:
ADENOSINE A1 ADORA1 GUINEA PIG::P47745
Residue:
326
  
Inhibitor
Name:
BDBM50004562
Synonyms:
CHEMBL308499 N-(2-Dimethylamino-ethyl)-4-(2,6-dioxo-1,3-dipropyl-2,3,6,7-tetrahydro-1H-purin-8-yl)-N-methyl-benzenesulfonamide(PD-115199) | PD-115199
Type:
Small organic molecule
Emp. Form.:
C22H32N6O4S
Mol. Mass.:
476.592
SMILES:
CCCn1c2nc([nH]c2c(=O)n(CCC)c1=O)-c1ccc(cc1)S(=O)(=O)N(C)CCN(C)C
: