Target
Platelet-activating factor receptor
Ligand
BDBM50004642
Substrate
Meas. Tech.
ChEBML_162882
IC50
10±n/a nM
Citation
 Cooper, KFray, MJParry, MJRichardson, KSteele, J 1,4-Dihydropyridines as antagonists of platelet activating factor. 1. Synthesis and structure-activity relationships of 2-(4-heterocyclyl)phenyl derivatives. J Med Chem 35:3115-29 (1992)  
Target
Name:
Platelet-activating factor receptor
Synonyms:
PAF-R PTAFR_CAVPO Platelet-activating factor receptor
Type:
Protein
Mol. Mass.:
39005.63
Organism:
Cavia porcellus
Description:
Residue:
342
  
Inhibitor
Name:
BDBM50004642
Synonyms:
4-(2-Chloro-phenyl)-2-[4-(2,4-dimethyl-thiazol-5-yl)-phenyl]-6-methyl-5-(pyridin-2-ylcarbamoyl)-1,4-dihydro-pyridine-3-carboxylic acid ethyl ester (0.5 H2O) | CHEMBL323429
Type:
Small organic molecule
Emp. Form.:
C32H29ClN4O3S
Mol. Mass.:
585.116
SMILES:
CCOC(=O)C1=C(N=C(C)C(C1c1ccccc1Cl)C(=O)Nc1ccccn1)c1ccc(cc1)-c1sc(C)nc1C
: