Target
Endothelin-1 receptor
Ligand
BDBM50001221
Substrate
Meas. Tech.
ChEBML_64038
IC50
1000±n/a nM
Citation
 Cody, WLDoherty, AMHe, JXDePue, PLRapundalo, STHingorani, GAMajor, TCPanek, RLDudley, DTHaleen, SJ Design of a functional hexapeptide antagonist of endothelin. J Med Chem 35:3301-3 (1992)  
Target
Name:
Endothelin-1 receptor
Synonyms:
EDNRA ET-A ETA-R Endothelin receptor type A hET-AR
Type:
Enzyme Catalytic Domain
Mol. Mass.:
48736.88
Organism:
Homo sapiens (Human)
Description:
P25101
Residue:
427
  
Inhibitor
Name:
BDBM50001221
Synonyms:
3-[2-(2-Acetylamino-3-naphthalen-2-yl-propionylamino)-4-methyl-pentanoylamino]-N-(1-{1-[1-carboxy-2-(1H-indol-3-yl)-ethylcarbamoyl]-2-methyl-butylcarbamoyl}-2-methyl-butyl)-succinamic acid | CHEMBL315047
Type:
Small organic molecule
Emp. Form.:
C48H63N7O10
Mol. Mass.:
898.0547
SMILES:
CC[C@H](C)[C@H](NC(=O)[C@H](CC(O)=O)NC(=O)[C@H](CC(C)C)NC(=O)[C@@H](Cc1ccc2ccccc2c1)NC(C)=O)C(=O)N[C@@H]([C@@H](C)CC)C(=O)N[C@@H](Cc1c[nH]c2ccccc12)C(O)=O
: