Target
Glutamate receptor ionotropic, NMDA 1
Ligand
BDBM22778
Substrate
Meas. Tech.
ChEBML_140542
Ki
210±n/a nM
Citation
 McQuaid, LASmith, ECSouth, KKMitch, CHSchoepp, DDTrue, RACalligaro, DOO'Malley, PJLodge, DOrnstein, PL Synthesis and excitatory amino acid pharmacology of a series of heterocyclic-fused quinoxalinones and quinazolinones. J Med Chem 35:3319-24 (1992)  
Target
Name:
Glutamate receptor ionotropic, NMDA 1
Synonyms:
Glutamate (NMDA) receptor subunit zeta 1 Glutamate-NMDA-Channel Glutamate-NMDA-Polyamine NMDA Nmdar1 | phencyclidine
Type:
Enzyme Catalytic Domain
Mol. Mass.:
105533.40
Organism:
RAT
Description:
P35439
Residue:
938
  
Inhibitor
Name:
BDBM22778
Synonyms:
6,7-Dichloro-1,4-dihydro-quinoxaline-2,3-dione Benzil-related compound, 58 | CHEMBL284028
Type:
Small organic molecule
Emp. Form.:
C8H4Cl2N2O2
Mol. Mass.:
231.036
SMILES:
Clc1cc2[nH]c(=O)c(=O)[nH]c2cc1Cl
: