Target
3-hydroxy-3-methylglutaryl-coenzyme A reductase
Ligand
BDBM50455629
Substrate
Meas. Tech.
ChEBML_80475
IC50
12±n/a nM
Citation
 Bone, EADavidson, AHLewis, CNTodd, RS Synthesis and biological evaluation of dihydroeptastatin, a novel inhibitor of 3-hydroxy-3-methylglutaryl coenzyme A reductase. J Med Chem 35:3388-93 (1992)  
Target
Name:
3-hydroxy-3-methylglutaryl-coenzyme A reductase
Synonyms:
3-hydroxy-3-methylglutaryl-coenzyme A (HMG-CoA) reductase HMDH_HUMAN HMG-CoA reductase (HMGR) | HMGCR
Type:
Enzyme
Mol. Mass.:
97477.10
Organism:
Homo sapiens (Human)
Description:
P04035
Residue:
888
  
Inhibitor
Name:
BDBM50455629
Synonyms:
CHEMBL487720
Type:
Small organic molecule
Emp. Form.:
C25H39NaO6
Mol. Mass.:
458.5633
SMILES:
[Na+].[H][C@@](O)(CC[C@@]1([H])[C@@H](C)C=CC2=C[C@H](C)C[C@H](OC(=O)C(C)(C)CC)[C@]12[H])C[C@@H](O)CC([O-])=O
: