Target
Gag-Pol polyprotein [489-587]
Ligand
BDBM50004785
Substrate
Meas. Tech.
ChEBML_79800
IC50
14000±n/a nM
Citation
 DeCamp, DLBabé, LMSalto, RLucich, JLKoo, MSKahl, SBCraik, CS Specific inhibition of HIV-1 protease by boronated porphyrins. J Med Chem 35:3426-8 (1992)  
Target
Name:
Gag-Pol polyprotein [489-587]
Synonyms:
Human immunodeficiency virus type 1 protease Pol polyprotein | gag-pol
Type:
Enzyme Subunit
Mol. Mass.:
10781.16
Organism:
Human immunodeficiency virus type 1
Description:
P04585[489-587]
Residue:
99
  
Inhibitor
Name:
BDBM50004785
Synonyms:
CHEMBL217693 | Porphyrin analogue
Type:
Small organic molecule
Emp. Form.:
C62H54N4O12
Mol. Mass.:
1047.1118
SMILES:
Cc1c(CCC(O)=O)c2cc3nc(cc4[nH]c(cc5[nH]c(cc1n2)c(C)c5C(COC(=O)c1ccccc1)OC(=O)c1ccccc1)c(C)c4C(COC(=O)c1ccccc1)OC(=O)c1ccccc1)c(C)c3CCC(O)=O
: